OpenCores
no use no use 1/1 no use no use
or1ksim make check failed
by vjraj on Jun 20, 2012
vjraj
Posts: 30
Joined: Jun 2, 2010
Last seen: Jan 15, 2017
Hi,

I completed the or1ksim and GNU toolchain setup under ubuntu and set the PATH variable accordingly. But when I run "make check" to run the or1ksim testsuite, it is failing with the following message:

Making check in lib
make[2]: Entering directory `/home/lrajani/ortool/or1ksim/build_or1ksim/testsuite/lib'
make[2]: Nothing to be done for `check'.
make[2]: Leaving directory `/home/lrajani/ortool/or1ksim/build_or1ksim/testsuite/lib'
Making check in libsim.tests
make[2]: Entering directory `/home/lrajani/ortool/or1ksim/build_or1ksim/testsuite/libsim.tests'
make[2]: Nothing to be done for `check'.
make[2]: Leaving directory `/home/lrajani/ortool/or1ksim/build_or1ksim/testsuite/libsim.tests'
Making check in or1ksim.tests
make[2]: Entering directory `/home/lrajani/ortool/or1ksim/build_or1ksim/testsuite/or1ksim.tests'
make[2]: Nothing to be done for `check'.
make[2]: Leaving directory `/home/lrajani/ortool/or1ksim/build_or1ksim/testsuite/or1ksim.tests'
Making check in test-code
make[2]: Entering directory `/home/lrajani/ortool/or1ksim/build_or1ksim/testsuite/test-code'
Making check in lib-iftest
make[3]: Entering directory `/home/lrajani/ortool/or1ksim/build_or1ksim/testsuite/test-code/lib-iftest'
make lib-iftest
make[4]: Entering directory `/home/lrajani/ortool/or1ksim/build_or1ksim/testsuite/test-code/lib-iftest'
make[4]: `lib-iftest' is up to date.
make[4]: Leaving directory `/home/lrajani/ortool/or1ksim/build_or1ksim/testsuite/test-code/lib-iftest'
make[3]: Leaving directory `/home/lrajani/ortool/or1ksim/build_or1ksim/testsuite/test-code/lib-iftest'
Making check in lib-inttest
make[3]: Entering directory `/home/lrajani/ortool/or1ksim/build_or1ksim/testsuite/test-code/lib-inttest'
make lib-inttest-edge lib-inttest-level
make[4]: Entering directory `/home/lrajani/ortool/or1ksim/build_or1ksim/testsuite/test-code/lib-inttest'
make[4]: `lib-inttest-edge' is up to date.
make[4]: `lib-inttest-level' is up to date.
make[4]: Leaving directory `/home/lrajani/ortool/or1ksim/build_or1ksim/testsuite/test-code/lib-inttest'
make[3]: Leaving directory `/home/lrajani/ortool/or1ksim/build_or1ksim/testsuite/test-code/lib-inttest'
Making check in lib-jtag
make[3]: Entering directory `/home/lrajani/ortool/or1ksim/build_or1ksim/testsuite/test-code/lib-jtag'
make lib-jtag lib-jtag-full
make[4]: Entering directory `/home/lrajani/ortool/or1ksim/build_or1ksim/testsuite/test-code/lib-jtag'
make[4]: `lib-jtag' is up to date.
make[4]: `lib-jtag-full' is up to date.
make[4]: Leaving directory `/home/lrajani/ortool/or1ksim/build_or1ksim/testsuite/test-code/lib-jtag'
make[3]: Leaving directory `/home/lrajani/ortool/or1ksim/build_or1ksim/testsuite/test-code/lib-jtag'
Making check in lib-upcalls
make[3]: Entering directory `/home/lrajani/ortool/or1ksim/build_or1ksim/testsuite/test-code/lib-upcalls'
make lib-upcalls
make[4]: Entering directory `/home/lrajani/ortool/or1ksim/build_or1ksim/testsuite/test-code/lib-upcalls'
make[4]: `lib-upcalls' is up to date.
make[4]: Leaving directory `/home/lrajani/ortool/or1ksim/build_or1ksim/testsuite/test-code/lib-upcalls'
make[3]: Leaving directory `/home/lrajani/ortool/or1ksim/build_or1ksim/testsuite/test-code/lib-upcalls'
make[3]: Entering directory `/home/lrajani/ortool/or1ksim/build_or1ksim/testsuite/test-code'
make[3]: Nothing to be done for `check-am'.
make[3]: Leaving directory `/home/lrajani/ortool/or1ksim/build_or1ksim/testsuite/test-code'
make[2]: Leaving directory `/home/lrajani/ortool/or1ksim/build_or1ksim/testsuite/test-code'
Making check in test-code-or1k
make[2]: Entering directory `/home/lrajani/ortool/or1ksim/build_or1ksim/testsuite/test-code-or1k'
Making check in support
make[3]: Entering directory `/home/lrajani/ortool/or1ksim/build_or1ksim/testsuite/test-code-or1k/support'
make libsupport.la
make[4]: Entering directory `/home/lrajani/ortool/or1ksim/build_or1ksim/testsuite/test-code-or1k/support'
/bin/bash ../libtool --tag=CC --mode=compile /home/lrajani/ortool/or1ksim/compile -DHAVE_CONFIG_H -I. -I../../../../testsuite/test-code-or1k/support -I.. -I../../../../testsuite/test-code-or1k/support -I../../../../testsuite/test-code-or1k/mc-common -Wall -Werror -g -nostdlib -mhard-div -mhard-mul -MT int.lo -MD -MP -MF .deps/int.Tpo -c -o int.lo ../../../../testsuite/test-code-or1k/support/int.c
libtool: compile: /home/lrajani/ortool/or1ksim/compile -DHAVE_CONFIG_H -I. -I../../../../testsuite/test-code-or1k/support -I.. -I../../../../testsuite/test-code-or1k/support -I../../../../testsuite/test-code-or1k/mc-common -Wall -Werror -g -nostdlib -mhard-div -mhard-mul -MT int.lo -MD -MP -MF .deps/int.Tpo -c ../../../../testsuite/test-code-or1k/support/int.c -fPIC -DPIC -o .libs/int.o
/home/lrajani/ortool/or1ksim/compile: 123: -DHAVE_CONFIG_H: not found
make[4]: *** [int.lo] Error 1
make[4]: Leaving directory `/home/lrajani/ortool/or1ksim/build_or1ksim/testsuite/test-code-or1k/support'
make[3]: *** [check-am] Error 2
make[3]: Leaving directory `/home/lrajani/ortool/or1ksim/build_or1ksim/testsuite/test-code-or1k/support'
make[2]: *** [check-recursive] Error 1
make[2]: Leaving directory `/home/lrajani/ortool/or1ksim/build_or1ksim/testsuite/test-code-or1k'
make[1]: *** [check-recursive] Error 1
make[1]: Leaving directory `/home/lrajani/ortool/or1ksim/build_or1ksim/testsuite'
make: *** [check-recursive] Error 1


Please let me know how I can overcome this issue.



Thanks,
Rajani
RE: or1ksim make check failed
by vjraj on Jun 20, 2012
vjraj
Posts: 30
Joined: Jun 2, 2010
Last seen: Jan 15, 2017
Okay, I overcame the issue when I created the directory "build_or1ksim" parallel to or1ksim directory.

But now I am getting the following error:

make check-DEJAGNU
make[3]: Entering directory `/home/lrajani/ortool/build_or1ksim/testsuite'
Making a new site.exp file...
srcdir=`CDPATH="${ZSH_VERSION+.}:" && cd ../../or1ksim/testsuite && pwd`; export srcdir; \
EXPECT=expect; export EXPECT; \
runtest=runtest; \
if /bin/bash -c "$runtest --version" > /dev/null 2>&1; then \
exit_status=0; l='libsim or1ksim'; for tool in $l; do \
if $runtest --tool $tool ; \
then :; else exit_status=1; fi; \
done; \
else echo "WARNING: could not find \`runtest'" 1>&2; :;\
fi; \
exit $exit_status
WARNING: could not find `runtest'
make[3]: Leaving directory `/home/lrajani/ortool/build_or1ksim/testsuite'
make[2]: Leaving directory `/home/lrajani/ortool/build_or1ksim/testsuite'
make[1]: Leaving directory `/home/lrajani/ortool/build_or1ksim/testsuite'
make[1]: Entering directory `/home/lrajani/ortool/build_or1ksim'
make[1]: Leaving directory `/home/lrajani/ortool/build_or1ksim'


Please help.

-Rajani
RE: or1ksim make check failed
by vjraj on Jun 20, 2012
vjraj
Posts: 30
Joined: Jun 2, 2010
Last seen: Jan 15, 2017
Okay, I fixed this issue as well. The DejaGNU package was not properly installed. It is running the or1ksim tests now.

Please mark this case as closed.

Thanks,
Rajani
no use no use 1/1 no use no use
© copyright 1999-2026 OpenCores.org, equivalent to Oliscience, all rights reserved. OpenCores®, registered trademark.