1/1

|
Problem with make rtl-test
by andresjk on Jun 30, 2012 |
andresjk
Posts: 5 Joined: Apr 6, 2012 Last seen: Jan 19, 2014 |
||
|
Hi all,
I'm new to Linux and OpenRISC. However, I plan to make my thesis based in OR and collaborate with the community in a near future. I have already the GNU toolchain installed on my computer using opencores.org guide.I have Xilinx ISE 13.3 installed as well in my Ubuntu 11.04 (2.6.38-15) I downloaded the ORPSoCv2 and the problem occurs when I try to run 'make rtl-test' from the orpsocv2/sim/run. I get some error making the bin2vmem, seems to me that is a mismatch in the libstdc++ version that is using the ISE but I'm not sure and I don't know how to solve it. Should I install the libraries? how? Thanks in advance. Andres My terminal log: andres@andres-laptop:/opt/orpsocv2/sim/run$ make rtl-test ### Compiling software ### make[1]: Entering directory `/opt/orpsocv2/sw/tests/or1200/sim' make[2]: Entering directory `/opt/orpsocv2/sw/drivers/or1200' ### Creating software defines header from verilog defines ### ### Creating OR1200 software defines header from verilog defines ### make[2]: Leaving directory `/opt/orpsocv2/sw/drivers/or1200' ### Building software support library ### make[2]: Entering directory `/opt/orpsocv2/sw/lib' make[3]: Entering directory `/opt/orpsocv2/sw/drivers/cfi-ctrl' make[3]: Leaving directory `/opt/orpsocv2/sw/drivers/cfi-ctrl' make[3]: Entering directory `/opt/orpsocv2/sw/drivers/ethmac' make[3]: Leaving directory `/opt/orpsocv2/sw/drivers/ethmac' make[3]: Entering directory `/opt/orpsocv2/sw/drivers/i2c_master_slave' make[3]: Leaving directory `/opt/orpsocv2/sw/drivers/i2c_master_slave' make[3]: Entering directory `/opt/orpsocv2/sw/drivers/or1200' make[3]: Leaving directory `/opt/orpsocv2/sw/drivers/or1200' make[3]: Entering directory `/opt/orpsocv2/sw/drivers/simple-spi' make[3]: Leaving directory `/opt/orpsocv2/sw/drivers/simple-spi' make[3]: Entering directory `/opt/orpsocv2/sw/drivers/uart' make[3]: Leaving directory `/opt/orpsocv2/sw/drivers/uart' make[2]: Leaving directory `/opt/orpsocv2/sw/lib' make[2]: Entering directory `/opt/orpsocv2/sw/utils' gcc -o bin2vmem -O2 -Wall bin2vmem.c /usr/lib/i386-linux-gnu/gcc/i686-linux-gnu/4.5.2/cc1: /opt/Xilinx/13.3/ISE_DS/common/lib/lin/libstdc++.so.6: version `GLIBCXX_3.4.14' not found (required by /usr/lib/libppl_c.so.2) /usr/lib/i386-linux-gnu/gcc/i686-linux-gnu/4.5.2/cc1: /opt/Xilinx/13.3/ISE_DS/common/lib/lin/libstdc++.so.6: version `GLIBCXX_3.4.11' not found (required by /usr/lib/libppl_c.so.2) /usr/lib/i386-linux-gnu/gcc/i686-linux-gnu/4.5.2/cc1: /opt/Xilinx/13.3/ISE_DS/common/lib/lin/libstdc++.so.6: version `GLIBCXX_3.4.9' not found (required by /usr/lib/libppl_c.so.2) /usr/lib/i386-linux-gnu/gcc/i686-linux-gnu/4.5.2/cc1: /opt/Xilinx/13.3/ISE_DS/common/lib/lin/libstdc++.so.6: version `GLIBCXX_3.4.14' not found (required by /usr/lib/libppl.so.7) /usr/lib/i386-linux-gnu/gcc/i686-linux-gnu/4.5.2/cc1: /opt/Xilinx/13.3/ISE_DS/common/lib/lin/libstdc++.so.6: version `GLIBCXX_3.4.11' not found (required by /usr/lib/libppl.so.7) /usr/lib/i386-linux-gnu/gcc/i686-linux-gnu/4.5.2/cc1: /opt/Xilinx/13.3/ISE_DS/common/lib/lin/libstdc++.so.6: version `GLIBCXX_3.4.9' not found (required by /usr/lib/libppl.so.7) /usr/lib/i386-linux-gnu/gcc/i686-linux-gnu/4.5.2/cc1: /opt/Xilinx/13.3/ISE_DS/common/lib/lin/libstdc++.so.6: version `GLIBCXX_3.4.11' not found (required by /usr/lib/libgmpxx.so.4) make[2]: *** [bin2vmem] Error 1 make[2]: Leaving directory `/opt/orpsocv2/sw/utils' make[1]: *** [../../../utils/bin2vmem] Error 2 make[1]: Leaving directory `/opt/orpsocv2/sw/tests/or1200/sim' make: *** [/opt/orpsocv2/sim/run/../../sw/tests/or1200/sim/or1200-simple.vmem] Error 2 |
|||
|
RE: Problem with make rtl-test
by andresjk on Jul 2, 2012 |
andresjk
Posts: 5 Joined: Apr 6, 2012 Last seen: Jan 19, 2014 |
||
|
Solved. Thanks
|
|||
1/1

